{"text_format":"1","workbook":"xlsx","n_sheets":9,"sheets":["使用方法","基本となる情報","データ入力","所見編集","アンケート","３年","４年","５年","６年"],"not_rendered":{"charts":0,"images":5,"macros":1,"external_links":1,"defined_names":3,"comments":0,"pivot_tables":0},"unopened":[],"bounds":{"document_bytes":16777216,"sheet_cells":100000,"rows_first":2000,"rows_last":500,"rows_between":2000,"halvings":0,"cell_chars":16384,"cell_head_chars":4096},"cells_cut":0,"cells_raw":0,"read":"whole","date_system":"1900"}

{"sheet":"使用方法","index":0,"n_rows":53,"n_cols":11,"rows_kept":53,"cut":false,"hidden":false,"merged":[[2,1,2,11]]}
[null,null,"総合的な学習　所見作成支援の使いかた"]
[]
[null,"所見作成の流れ\n　１．［アンケート］シートを適宜変更して、児童からアンケートを取る。\n　２．アンケートをもとに、データを数字で入力する。\n　３．指定された文字数に合うように手直しする。\n　４．完成した所見文を校務支援システムなどに貼り付ける。"]
[]
[]
[]
[null,"シート"]
[]
["学年","４年"]
[]
["番号","氏名","基本の例文","個人テーマ","追求方法","表現方法","育った力"]
[1,"あ","例１",1,1,1,1]
[2,"い","例２",2,2,2,2]
[3,"う","例３",3,3,3,3]
[4,"え","例４",4,4,4,4]
[5,"お","例５",5,5,5,5]
[6]
[7]
[]
[]
{"$rows_left_out":34}
{"sheet":"基本となる情報","index":1,"n_rows":7,"n_cols":15,"rows_kept":7,"cut":false,"hidden":false,"merged":[[1,1,1,2],[1,4,1,5],[1,7,1,8],[1,10,1,11],[1,13,1,14]]}
[]
[null,"学年テーマ",null,null,"個人テーマ",null,null,"追求方法",null,null,"表現方法",null,null,"育った力"]
[null,"３年","巴川",null,1,"麻機れんこん",null,1,"図書室の本など",null,1,"模造紙",null,1,"課題を設定する力"]
[null,"４年","福祉",null,2,"遊水池",null,2,"図書館の本など",null,2,"画用紙",null,2,"課題を追求する力"]
[null,"５年","防災",null,3,"みかん",null,3,"インタビューなど",null,3,"壁新聞",null,3,"学んだことを表現する力"]
[null,"６年","地域の魅力",null,4,"巴川",null,4,"インターネットなど",null,4,"プレゼン",null,4,"自己を見つめる"]
[null,null,null,null,5,"福祉施設",null,5,null,null,5,null,null,5]

{"sheet":"データ入力","index":2,"n_rows":44,"n_cols":34,"rows_kept":44,"cut":false,"hidden":false,"merged":[]}
[]
[null,"学年","４年"]
[]
[null,"番号","氏名","基本の例文","個人テーマ","追求方法","表現方法","育った力",null,null,null,null,null,null,null,null,null,null,null,null,null,"組み合わせ",null,"基本の例文","学年",null,"個人テーマ",null,"追求方法",null,"表現方法",null,"育った力"]
[null,1,"あ","例１",1,1,1,1,null,{"$f":"VLOOKUP(C2,基本となる情報!B3:C6,2)","v":"福祉"},{"$f":"IF(C5=\"\",\"\",VLOOKUP(D5,$X$5:$AH$9,3))","v":"では、"},{"$f":"IF(C5=\"\",\"\",VLOOKUP(E5,基本となる情報!$E$3:$F$7,2))","v":"麻機れんこん"},{"$f":"IF(C5=\"\",\"\",VLOOKUP(D5,$X$5:$AH$9,5))","v":"について興味を持ち"},{"$f":"IF(C5=\"\",\"\",VLOOKUP(F5,基本となる情報!$H$3:$I$7,2))","v":"図書室の本など"},{"$f":"IF(C5=\"\",\"\",VLOOKUP(D5,$X$5:$AH$9,7))","v":"で調べました。"},{"$f":"IF(C5=\"\",\"\",VLOOKUP(G5,基本となる情報!$K$3:$L$7,2))","v":"模造紙"},{"$f":"IF(C5=\"\",\"\",VLOOKUP(D5,$X$5:$AH$9,9))","v":"で発表することを通して"},{"$f":"IF(C5=\"\",\"\",VLOOKUP(H5,基本となる情報!$N$3:$O$7,2))","v":"課題を設定する力"},{"$f":"IF(C5=\"\",\"\",VLOOKUP(D5,$X$5:$AH$9,11))","v":"が育ちました。"},null,null,{"$f":"IF(C5=\"\",\"\",CONCATENATE(J5,K5,L5,M5,N5,O5,P5,Q5,R5,S5))","v":"福祉では、麻機れんこんについて興味を持ち図書室の本などで調べました。模造紙で発表することを通して課題を設定する力が育ちました。"},null,"例１",null,"では、",null,"について興味を持ち",null,"で調べました。",null,"で発表することを通して",null,"が育ちました。"]
[null,2,"い","例２",2,2,2,2,null,{"$f":"IF(C6=\"\",\"\",J5)","v":"福祉"},{"$f":"IF(C6=\"\",\"\",VLOOKUP(D6,$X$5:$AH$9,3))","v":"では、"},{"$f":"IF(C6=\"\",\"\",VLOOKUP(E6,基本となる情報!$E$3:$F$7,2))","v":"遊水池"},{"$f":"IF(C6=\"\",\"\",VLOOKUP(D6,$X$5:$AH$9,5))","v":"について調べるために"},{"$f":"IF(C6=\"\",\"\",VLOOKUP(F6,基本となる情報!$H$3:$I$7,2))","v":"図書館の本など"},{"$f":"IF(C6=\"\",\"\",VLOOKUP(D6,$X$5:$AH$9,7))","v":"を利用しました。"},{"$f":"IF(C6=\"\",\"\",VLOOKUP(G6,基本となる情報!$K$3:$L$7,2))","v":"画用紙"},{"$f":"IF(C6=\"\",\"\",VLOOKUP(D6,$X$5:$AH$9,9))","v":"にまとめました。"},{"$f":"IF(C6=\"\",\"\",VLOOKUP(H6,基本となる情報!$N$3:$O$7,2))","v":"課題を追求する力"},{"$f":"IF(C6=\"\",\"\",VLOOKUP(D6,$X$5:$AH$9,11))","v":"が身に付きました。"},null,null,{"$f":"IF(C6=\"\",\"\",CONCATENATE(J6,K6,L6,M6,N6,O6,P6,Q6,R6,S6))","v":"福祉では、遊水池について調べるために図書館の本などを利用しました。画用紙にまとめました。課題を追求する力が身に付きました。"},null,"例２",null,"では、",null,"について調べるために",null,"を利用しました。",null,"にまとめました。",null,"が身に付きました。"]
[null,3,"う","例３",3,3,3,3,null,"福祉","の学習で、",{"$f":"IF(C7=\"\",\"\",VLOOKUP(E7,基本となる情報!$E$3:$F$7,2))","v":"みかん"},"について興味を持ち",{"$f":"IF(C7=\"\",\"\",VLOOKUP(F7,基本となる情報!$H$3:$I$7,2))","v":"インタビューなど"},"を行いました。",{"$f":"IF(C7=\"\",\"\",VLOOKUP(G7,基本となる情報!$K$3:$L$7,2))","v":"壁新聞"},"で発表を行いました。",{"$f":"IF(C7=\"\",\"\",VLOOKUP(H7,基本となる情報!$N$3:$O$7,2))","v":"学んだことを表現する力"},"への理解が深まりました。",null,null,"福祉の学習で、みかんについて興味を持ちインタビューなどを行いました。壁新聞で発表を行いました。学んだことを表現する力への理解が深まりました。",null,"例３",null,"の学習で、",null,"について興味を持ち",null,"を行いました。",null,"で発表を行いました。",null,"への理解が深まりました。"]
[null,4,"え","例４",4,4,4,4,null,"福祉","の学習で、",{"$f":"IF(C8=\"\",\"\",VLOOKUP(E8,基本となる情報!$E$3:$F$7,2))","v":"巴川"},"について調べるために",{"$f":"IF(C8=\"\",\"\",VLOOKUP(F8,基本となる情報!$H$3:$I$7,2))","v":"インターネットなど"},"について理解しました。",{"$f":"IF(C8=\"\",\"\",VLOOKUP(G8,基本となる情報!$K$3:$L$7,2))","v":"プレゼン"},"を使って調べたことを通して",{"$f":"IF(C8=\"\",\"\",VLOOKUP(H8,基本となる情報!$N$3:$O$7,2))","v":"自己を見つめる"},"が身に付きつつあります。",null,null,"福祉の学習で、巴川について調べるためにインターネットなどについて理解しました。プレゼンを使って調べたことを通して自己を見つめるが身に付きつつあります。",null,"例４",null,"の学習で、",null,"について調べるために",null,"について理解しました。",null,"を使って調べたことを通して",null,"が身に付きつつあります。"]
[null,5,"お","例５",5,5,5,5,null,"福祉","で、",{"$f":"IF(C9=\"\",\"\",VLOOKUP(E9,基本となる情報!$E$3:$F$7,2))","v":"福祉施設"},"の体験を通して",{"$f":"IF(C9=\"\",\"\",VLOOKUP(F9,基本となる情報!$H$3:$I$7,2))","v":0},"について理解しました。",{"$f":"IF(C9=\"\",\"\",VLOOKUP(G9,基本となる情報!$K$3:$L$7,2))","v":0},"調べて発表することを通して",{"$f":"IF(C9=\"\",\"\",VLOOKUP(H9,基本となる情報!$N$3:$O$7,2))","v":0},"ことができました。",null,null,"福祉で、福祉施設の体験を通して0について理解しました。0調べて発表することを通して0ことができました。",null,"例５",null,"で、",null,"の体験を通して",null,"について理解しました。",null,"調べて発表することを通して",null,"ことができました。"]
[null,6,null,null,null,null,null,null,null,"","",{"$f":"IF(C10=\"\",\"\",VLOOKUP(E10,基本となる情報!$E$3:$F$7,2))","v":""},"",{"$f":"IF(C10=\"\",\"\",VLOOKUP(F10,基本となる情報!$H$3:$I$7,2))","v":""},"",{"$f":"IF(C10=\"\",\"\",VLOOKUP(G10,基本となる情報!$K$3:$L$7,2))","v":""},"",{"$f":"IF(C10=\"\",\"\",VLOOKUP(H10,基本となる情報!$N$3:$O$7,2))","v":""},"",null,null,""]
[null,7,null,null,null,null,null,null,null,"","",{"$f":"IF(C11=\"\",\"\",VLOOKUP(E11,基本となる情報!$E$3:$F$7,2))","v":""},"",{"$f":"IF(C11=\"\",\"\",VLOOKUP(F11,基本となる情報!$H$3:$I$7,2))","v":""},"",{"$f":"IF(C11=\"\",\"\",VLOOKUP(G11,基本となる情報!$K$3:$L$7,2))","v":""},"",{"$f":"IF(C11=\"\",\"\",VLOOKUP(H11,基本となる情報!$N$3:$O$7,2))","v":""},"",null,null,""]
[null,8,null,null,null,null,null,null,null,"","",{"$f":"IF(C12=\"\",\"\",VLOOKUP(E12,基本となる情報!$E$3:$F$7,2))","v":""},"",{"$f":"IF(C12=\"\",\"\",VLOOKUP(F12,基本となる情報!$H$3:$I$7,2))","v":""},"",{"$f":"IF(C12=\"\",\"\",VLOOKUP(G12,基本となる情報!$K$3:$L$7,2))","v":""},"",{"$f":"IF(C12=\"\",\"\",VLOOKUP(H12,基本となる情報!$N$3:$O$7,2))","v":""},"",null,null,""]
[null,9,null,null,null,null,null,null,null,"","",{"$f":"IF(C13=\"\",\"\",VLOOKUP(E13,基本となる情報!$E$3:$F$7,2))","v":""},"",{"$f":"IF(C13=\"\",\"\",VLOOKUP(F13,基本となる情報!$H$3:$I$7,2))","v":""},"",{"$f":"IF(C13=\"\",\"\",VLOOKUP(G13,基本となる情報!$K$3:$L$7,2))","v":""},"",{"$f":"IF(C13=\"\",\"\",VLOOKUP(H13,基本となる情報!$N$3:$O$7,2))","v":""},"",null,null,""]
[null,10,null,null,null,null,null,null,null,"","",{"$f":"IF(C14=\"\",\"\",VLOOKUP(E14,基本となる情報!$E$3:$F$7,2))","v":""},"",{"$f":"IF(C14=\"\",\"\",VLOOKUP(F14,基本となる情報!$H$3:$I$7,2))","v":""},"",{"$f":"IF(C14=\"\",\"\",VLOOKUP(G14,基本となる情報!$K$3:$L$7,2))","v":""},"",{"$f":"IF(C14=\"\",\"\",VLOOKUP(H14,基本となる情報!$N$3:$O$7,2))","v":""},"",null,null,""]
[null,11,null,null,null,null,null,null,null,"","",{"$f":"IF(C15=\"\",\"\",VLOOKUP(E15,基本となる情報!$E$3:$F$7,2))","v":""},"",{"$f":"IF(C15=\"\",\"\",VLOOKUP(F15,基本となる情報!$H$3:$I$7,2))","v":""},"",{"$f":"IF(C15=\"\",\"\",VLOOKUP(G15,基本となる情報!$K$3:$L$7,2))","v":""},"",{"$f":"IF(C15=\"\",\"\",VLOOKUP(H15,基本となる情報!$N$3:$O$7,2))","v":""},"",null,null,""]
[null,12,null,null,null,null,null,null,null,"","",{"$f":"IF(C16=\"\",\"\",VLOOKUP(E16,基本となる情報!$E$3:$F$7,2))","v":""},"",{"$f":"IF(C16=\"\",\"\",VLOOKUP(F16,基本となる情報!$H$3:$I$7,2))","v":""},"",{"$f":"IF(C16=\"\",\"\",VLOOKUP(G16,基本となる情報!$K$3:$L$7,2))","v":""},"",{"$f":"IF(C16=\"\",\"\",VLOOKUP(H16,基本となる情報!$N$3:$O$7,2))","v":""},"",null,null,""]
[null,13,null,null,null,null,null,null,null,"","",{"$f":"IF(C17=\"\",\"\",VLOOKUP(E17,基本となる情報!$E$3:$F$7,2))","v":""},"",{"$f":"IF(C17=\"\",\"\",VLOOKUP(F17,基本となる情報!$H$3:$I$7,2))","v":""},"",{"$f":"IF(C17=\"\",\"\",VLOOKUP(G17,基本となる情報!$K$3:$L$7,2))","v":""},"",{"$f":"IF(C17=\"\",\"\",VLOOKUP(H17,基本となる情報!$N$3:$O$7,2))","v":""},"",null,null,""]
[null,14,null,null,null,null,null,null,null,"","",{"$f":"IF(C18=\"\",\"\",VLOOKUP(E18,基本となる情報!$E$3:$F$7,2))","v":""},"",{"$f":"IF(C18=\"\",\"\",VLOOKUP(F18,基本となる情報!$H$3:$I$7,2))","v":""},"",{"$f":"IF(C18=\"\",\"\",VLOOKUP(G18,基本となる情報!$K$3:$L$7,2))","v":""},"",{"$f":"IF(C18=\"\",\"\",VLOOKUP(H18,基本となる情報!$N$3:$O$7,2))","v":""},"",null,null,""]
[null,15,null,null,null,null,null,null,null,"","",{"$f":"IF(C19=\"\",\"\",VLOOKUP(E19,基本となる情報!$E$3:$F$7,2))","v":""},"",{"$f":"IF(C19=\"\",\"\",VLOOKUP(F19,基本となる情報!$H$3:$I$7,2))","v":""},"",{"$f":"IF(C19=\"\",\"\",VLOOKUP(G19,基本となる情報!$K$3:$L$7,2))","v":""},"",{"$f":"IF(C19=\"\",\"\",VLOOKUP(H19,基本となる情報!$N$3:$O$7,2))","v":""},"",null,null,""]
[null,16,null,null,null,null,null,null,null,"","",{"$f":"IF(C20=\"\",\"\",VLOOKUP(E20,基本となる情報!$E$3:$F$7,2))","v":""},"",{"$f":"IF(C20=\"\",\"\",VLOOKUP(F20,基本となる情報!$H$3:$I$7,2))","v":""},"",{"$f":"IF(C20=\"\",\"\",VLOOKUP(G20,基本となる情報!$K$3:$L$7,2))","v":""},"",{"$f":"IF(C20=\"\",\"\",VLOOKUP(H20,基本となる情報!$N$3:$O$7,2))","v":""},"",null,null,""]
{"$rows_left_out":25}
{"sheet":"所見編集","index":3,"n_rows":44,"n_cols":5,"rows_kept":44,"cut":false,"hidden":false,"merged":[]}
[]
[null,"学年",{"$f":"データ入力!C2","v":"４年"}]
[]
[null,"番号","氏名","所　見","文字数"]
[null,{"$f":"データ入力!B5","v":1},{"$f":"IF(データ入力!C5=\"\",\"\",データ入力!C5)","v":"あ"},"福祉では、麻機れんこんについて興味を持ち0で調べました。プレゼンで発表することを通して学んだことを表現する力が育ちました。",{"$f":"IF(データ入力!C5=\"\",\"\",LEN(D5))","v":61}]
[null,{"$f":"データ入力!B6","v":2},{"$f":"IF(データ入力!C6=\"\",\"\",データ入力!C6)","v":"い"},"福祉では、遊水池について調べるために図書館の本などを利用しました。画用紙にまとめました。課題を追求する力が身に付きました。",{"$f":"IF(データ入力!C6=\"\",\"\",LEN(D6))","v":61}]
[null,{"$f":"データ入力!B7","v":3},{"$f":"IF(データ入力!C7=\"\",\"\",データ入力!C7)","v":"う"},"福祉の学習で、みかんについて興味を持ちインタビューなどを行いました。壁新聞で発表を行いました。学んだことを表現する力への理解が深まりました。",{"$f":"IF(データ入力!C7=\"\",\"\",LEN(D7))","v":70}]
[null,{"$f":"データ入力!B8","v":4},{"$f":"IF(データ入力!C8=\"\",\"\",データ入力!C8)","v":"え"},"福祉の学習で、巴川について調べるためにインターネットなどについて理解しました。プレゼンを使って調べたことを通して自己を見つめるが身に付きつつあります。",{"$f":"IF(データ入力!C8=\"\",\"\",LEN(D8))","v":75}]
[null,{"$f":"データ入力!B9","v":5},{"$f":"IF(データ入力!C9=\"\",\"\",データ入力!C9)","v":"お"},"福祉で、福祉施設の体験を通して0について理解しました。0調べて発表することを通して0ことができました。",{"$f":"IF(データ入力!C9=\"\",\"\",LEN(D9))","v":51}]
[null,{"$f":"データ入力!B10","v":6},{"$f":"IF(データ入力!C10=\"\",\"\",データ入力!C10)","v":""},"",{"$f":"IF(データ入力!C10=\"\",\"\",LEN(D10))","v":""}]
[null,{"$f":"データ入力!B11","v":7},{"$f":"IF(データ入力!C11=\"\",\"\",データ入力!C11)","v":""},"",{"$f":"IF(データ入力!C11=\"\",\"\",LEN(D11))","v":""}]
[null,{"$f":"データ入力!B12","v":8},{"$f":"IF(データ入力!C12=\"\",\"\",データ入力!C12)","v":""},"",{"$f":"IF(データ入力!C12=\"\",\"\",LEN(D12))","v":""}]
[null,{"$f":"データ入力!B13","v":9},{"$f":"IF(データ入力!C13=\"\",\"\",データ入力!C13)","v":""},"",{"$f":"IF(データ入力!C13=\"\",\"\",LEN(D13))","v":""}]
[null,{"$f":"データ入力!B14","v":10},{"$f":"IF(データ入力!C14=\"\",\"\",データ入力!C14)","v":""},"",{"$f":"IF(データ入力!C14=\"\",\"\",LEN(D14))","v":""}]
[null,{"$f":"データ入力!B15","v":11},{"$f":"IF(データ入力!C15=\"\",\"\",データ入力!C15)","v":""},"",{"$f":"IF(データ入力!C15=\"\",\"\",LEN(D15))","v":""}]
[null,{"$f":"データ入力!B16","v":12},{"$f":"IF(データ入力!C16=\"\",\"\",データ入力!C16)","v":""},"",{"$f":"IF(データ入力!C16=\"\",\"\",LEN(D16))","v":""}]
[null,{"$f":"データ入力!B17","v":13},{"$f":"IF(データ入力!C17=\"\",\"\",データ入力!C17)","v":""},"",{"$f":"IF(データ入力!C17=\"\",\"\",LEN(D17))","v":""}]
[null,{"$f":"データ入力!B18","v":14},{"$f":"IF(データ入力!C18=\"\",\"\",データ入力!C18)","v":""},"",{"$f":"IF(データ入力!C18=\"\",\"\",LEN(D18))","v":""}]
[null,{"$f":"データ入力!B19","v":15},{"$f":"IF(データ入力!C19=\"\",\"\",データ入力!C19)","v":""},"",{"$f":"IF(データ入力!C19=\"\",\"\",LEN(D19))","v":""}]
[null,{"$f":"データ入力!B20","v":16},{"$f":"IF(データ入力!C20=\"\",\"\",データ入力!C20)","v":""},"",{"$f":"IF(データ入力!C20=\"\",\"\",LEN(D20))","v":""}]
{"$rows_left_out":25}
{"sheet":"アンケート","index":4,"n_rows":33,"n_cols":6,"rows_kept":33,"cut":false,"hidden":false,"merged":[[0,0,0,9]]}
["総合的な学習（○○タイム）のふりかえり"]
[null,null,null,null,null,"組　　　　　番　　名前　（　　　　　　　　　　　　　　）"]
[]
["学習の振り返り  あてはまるところに○をつけましょう。"]
["あなたのテーマは何ですか。"]
[null,"（　　　　）",1,{"$f":"IF(基本となる情報!F3=\"\",\"\",基本となる情報!F3)","v":"麻機れんこん"}]
[null,"（　　　　）",2,{"$f":"IF(基本となる情報!F4=\"\",\"\",基本となる情報!F4)","v":"遊水池"}]
[null,"（　　　　）",3,{"$f":"IF(基本となる情報!F5=\"\",\"\",基本となる情報!F5)","v":"みかん"}]
[null,"（　　　　）",4,{"$f":"IF(基本となる情報!F6=\"\",\"\",基本となる情報!F6)","v":"巴川"}]
[null,"（　　　　）",5,{"$f":"IF(基本となる情報!F7=\"\",\"\",基本となる情報!F7)","v":"福祉施設"}]
[]
["どんな方法で調べましたか。"]
[null,"（　　　　）",1,{"$f":"IF(基本となる情報!I3=\"\",\"\",基本となる情報!I3)","v":"図書室の本など"}]
[null,"（　　　　）",2,{"$f":"IF(基本となる情報!I4=\"\",\"\",基本となる情報!I4)","v":"図書館の本など"}]
[null,"（　　　　）",3,{"$f":"IF(基本となる情報!I5=\"\",\"\",基本となる情報!I5)","v":"インタビューなど"}]
[null,"（　　　　）",4,{"$f":"IF(基本となる情報!I6=\"\",\"\",基本となる情報!I6)","v":"インターネットなど"}]
[null,"（　　　　）",5,{"$f":"IF(基本となる情報!I7=\"\",\"\",基本となる情報!I7)","v":""}]
[]
["調べたことをどのようにまとめましたか。"]
[null,"（　　　　）",1,{"$f":"IF(基本となる情報!L3=\"\",\"\",基本となる情報!L3)","v":"模造紙"}]
{"$rows_left_out":14}
{"sheet":"３年","index":5,"n_rows":11,"n_cols":12,"rows_kept":11,"cut":false,"hidden":true,"merged":[[0,9,0,11]]}
["３年生",null,null,null,null,null,null,null,null,"活動の選択肢"]
[null,"単元","単元名","活　動","コミュニケーション","慣れ親しみ","理解・気づき",null,null,"活動１","活動２","活動３"]
[null,1,"Hello!「あいさつをして友達になろう」では、","世界の様々な言語での挨拶を知ったり、自分の名前を伝え、挨拶をしたりする活動を通して、","相手に伝わるように工夫しながら、名前を言って挨拶を交わすことができた。","挨拶や名前の言い方に慣れ親しむことができた。","世界には様々な言語があることに気付くことができた。",null,1,"世界の様々な言語での挨拶を知ったり、自分の名前を伝え、挨拶をしたりする活動を通して、","世界の様々な言語での挨拶を知ったり、自分の名前を伝え、挨拶をしたりする活動を通して、"]
[null,2,"How are you?「ごきげんいかが？」では、","友達と挨拶をして、ジェスチャーを交えて自分の様子や状態を伝える活動を通して、","表情やジェスチャーを付けて相手に伝わるように工夫しながら、挨拶をすることができた。","感情や状態を表す語や表現に慣れ親しむことができた。","表情やジェスチャーの大切さとともに表す意味の違いに気付くことができた。",null,2,"友達と挨拶をして、ジェスチャーを交えて自分の様子や状態を伝える活動を通して、","友達と挨拶をして、ジェスチャーを交えて自分の様子や状態を伝える活動を通して、"]
[null,3,"How many?「数えてあそぼう」では、","身の回りの物の数や、好きな漢字の画数を尋ねたり答えたりする活動を通して、","進んで、数を数えたり、尋ねたりしようとすることができた。","1～20の数の言い方や数の尋ね方に慣れ親しむことができた。","言語には、それぞれ特色があることに気付くことができた。",null,3,"身の回りの物の数や、好きな漢字の画数を尋ねたり答えたりする活動を通して、","身の回りの物の数や、好きな漢字の画数を尋ねたり答えたりする活動を通して、"]
[null,4,"I like blue.「すきなものをつたえよう」では、","自分の好きなものについて話したり、質問に答えたりする活動を通して、","進んで好みを尋ねたり答えたりして、伝え合うことができた。","色の言い方や、好きかどうかや何が好きかを尋ねたり答えたりする表現に慣れ親しむことができた。","多様な考え方があることや、日本語と英語の英語の違いに気付くことができた。",null,4,"自分の好きなものについて話したり、質問に答えたりする活動を通して、","自分の好きなものについて話したり、質問に答えたりする活動を通して、"]
[null,5,"What do youlike?「何がすき？」では、","どのような物が好きかを尋ねたり答えたりして伝え合う活動を通して、","進んで好きなものについて尋ねたり答えたりして伝え合うことができた。","色や形、好きなものは何かを尋ねる表現に慣れ親しむことができた。","スポーツや食べ物などの発音の仕方で、日本語と英語の音の違いに気付くことができた。",null,5,"どのような物が好きかを尋ねたり答えたりして伝え合う活動を通して、","どのような物が好きかを尋ねたり答えたりして伝え合う活動を通して、"]
[null,6,"ALPHABET「アルファベットとなかよし」では、","文字のカードを使って、自分の姓名の頭文字を伝え合う活動を通して、","進んで自分の姓名の頭文字を伝え合うことができた。","活字体の大文字とその読み方に慣れ親しむことができた。","身の回りには活字体の大文字で表されているものがあることに気付くことができた。",null,6,"文字のカードを使って、自分の姓名の頭文字を伝え合う活動を通して、","文字のカードを使って、自分の姓名の頭文字を伝え合う活動を通して、"]
[null,7,"This is for you.「カードをおくろう」では、","作成したカードを見せて紹介する活動を通して、","進んで相手の欲しいものを尋ねたり答えたりすることができた。","欲しいものを尋ねたり答えたりする表現に慣れ親しむことができた。","色や形の発音の仕方で、日本語と英語の音の違いに気付くことができた。",null,7,"作成したカードを見せて紹介する活動を通して、","作成したカードを見せて紹介する活動を通して、"]
[null,8,"What's this?「これなあに？」では、","身の回りの物に関するクイズを作って、動作を交えながら尋ねたり答えたりする活動を通して、","進んでクイズを出したり答えたりすることができた。","身の回りの物の言い方や、ある物が何かを尋ねたり、それが何かを答えたりする表現に慣れ親しむことができた。","外来語とそれが由来する英語の違いに気付くことができた。",null,8,"身の回りの物に関するクイズを作って、動作を交えながら尋ねたり答えたりする活動を通して、","身の回りの物に関するクイズを作って、動作を交えながら尋ねたり答えたりする活動を通して、"]
[null,9,"Who are you?～\"In the Autumn Forest\"～「きみはだれ？」では、","身の回りの物に関する簡単な語句やイラストなどを結び付ける活動を通して、","進んで絵本などの短い話を聞くとともに、台詞をまねして言うことができた。","誰かと尋ねたり、それに答えたりする表現に慣れ親しむことができた。","日本語と英語の音声やリズムなどの違いに気付くことができた。",null,9,"身の回りの物に関する簡単な語句やイラストなどを結び付ける活動を通して、","身の回りの物に関する簡単な語句やイラストなどを結び付ける活動を通して、"]

{"sheet":"４年","index":6,"n_rows":11,"n_cols":12,"rows_kept":11,"cut":false,"hidden":true,"merged":[[0,9,0,11]]}
["４年生",null,null,null,null,null,null,null,null,"活動の選択肢"]
[null,"単元","単元名","活　動","コミュニケーション","慣れ親しみ","理解・気づき",null,null,"活動１","活動２","活動３"]
[null,1,"Hello、 world!「世界のいろいろなことばであいさつをしよう」では、","世界のどの国の挨拶かを考える活動を通して、\n友達に好きなものなどを伝えたりして、挨拶をする活動を通して、","様々な挨拶の仕方があることに気付くことができた。","様々な挨拶の言い方に慣れ親しむことができた。","進んで友達と挨拶をして、自分の好みなどを伝えようとした。",null,1,"世界のどの国の挨拶かを考える活動を通して、","友達に好きなものなどを伝えたりして、挨拶をする活動を通して、"]
[null,2,"Let's play cards.「好きな遊びを伝えよう」では、","世界の様々な天気について知り、天気と衣類を結び付ける活動を通して、\n天気に合わせて行う遊びを決めたり提案したりする活動を通して、","進んで友達を自分の好きな遊びに誘おうとした。","様々な動作や遊びの言い方や、遊びに誘う表現に慣れ親しむことができた。","ジェスチャーの大切さや、表す意味の違いとともに、日本の遊びと世界の遊びの違いを通して、多様な考え方があることに気付くことができた。",null,2,"世界の様々な天気について知り、天気と衣類を結び付ける活動を通して、","天気に合わせて行う遊びを決めたり提案したりする活動を通して、"]
[null,3,"I like Mondays.「好きな曜日は何かな？」では、","曜日を尋ねたり答えたりし、自分の好きな曜日を伝え合う活動を通して、","進んで自分の好きな曜日について、尋ねたり答えたりして伝え合おうとした。","曜日の言い方や曜日を尋ねたり答えたりする表現に慣れ親しむことができた。","世界の同年代の子どもたちの生活を知ることができた。",null,3,"曜日を尋ねたり答えたりし、自分の好きな曜日を伝え合う活動を通して、"]
[null,4,"What time is it?「今、何時？」では、","イラストなどを参考に、一日の生活の中の自分の好きな時間を伝え合う活動を通して、","進んで自分の好きな時間について、尋ねたり答えたりして伝え合おうとした。","時刻や生活時間の言い方や尋ね方に慣れ親しむことができた。","世界の国や地域によって時刻が異なることに気付くことができた。",null,4,"イラストなどを参考に、一日の生活の中の自分の好きな時間を伝え合う活動を通して、"]
[null,5,"Do you have a pen?「おすすめの文房具セットをつくろう」では、","ある文房具などを持っているかどうかを尋ねたり答えたりする活動を通して、\n相手にプレゼントしたい文房具セットを考えて紹介する活動を通して、","進んで文房具などの持ち物について尋ねたり答えたりして伝え合おうとした。","文房具など学校で使う物の言い方や、持ち物を尋ねたり答えたりする表現に慣れ親しむことができた。","身の回りの物について、英語の音声やリズムなど日本語との違いに気付くことができた。",null,5,"ある文房具などを持っているかどうかを尋ねたり答えたりする活動を通して、","相手にプレゼントしたい文房具セットを考えて紹介する活動を通して、"]
[null,6,"Alphabet「アルファベットで文字遊びをしよう」では、","アルファベットの文字をヒントに、単語当てクイズをする活動を通して、","進んでアルファベットの文字について尋ねたり答えたりした。","活字体の小文字と、その読み方に慣れ親しむことができた。","身の回りにはアルファベットの活字体の文字で表されているものがたくさんあることに気付くことができた。",null,6,"アルファベットの文字をヒントに、単語当てクイズをする活動を通して、"]
[null,7,"What do you want?「ほしいものは何かな」では、","相手に勧めたいオリジナルメニュ―を作るために、必要な食材についてやり取りをする活動を通して、\n作ったオリジナルメニューを見せながら紹介する活動を通して、","進んで欲しい食材などを尋ねたり要求したりするとともに、考えたメニューを紹介し合おうとした。","食材の言い方や、ほしい物を尋ねたり要求したりする表現に慣れ親しむことができた。","果物や野菜などの食材の英語の音声やリズムが日本語と違うことに気付くことができた。",null,7,"相手に勧めたいオリジナルメニュ―を作るために、必要な食材についてやり取りをする活動を通して、","作ったオリジナルメニューを見せながら紹介する活動を通して、"]
[null,8,"This is my favorite place.「お気に入りの場所をしょうかいしよう」では、","自分が気に入っている校内の場所についてイラストや写真を参考に自分の考えなどを伝えたり、その場所まで案内したりする活動を通して、","進んで自分が気に入っている場所を伝えようとした。","教科名や教室名、案内の表現に慣れ親しむことができた。","世界と日本の学校生活の共通点や相違点を通して、多様な考え方があることに気付くことができた。",null,8,"自分が気に入っている校内の場所についてイラストや写真を参考に自分の考えなどを伝えたり、その場所まで案内したりする活動を通して、"]
[null,9,"This is my day.「ぼく・わたしの一日」では、","絵本の読み聞かせの中で聞いた、簡単な語句や基本的表現とイラストなどを結び付ける活動を通して、\n話の筋に合わせて、気に入ったページをグループで発表する活動を通して、","進んで絵本などの短い話を反応しながら聞こうとした。","絵本などの短い話を聞いて、おおよその内容を理解することができた。","日本語と英語の音声やリズムなどの違いに気付くことができた。",null,9,"絵本の読み聞かせの中で聞いた、簡単な語句や基本的表現とイラストなどを結び付ける活動を通して、","話の筋に合わせて、気に入ったページをグループで発表する活動を通して、"]

{"sheet":"５年","index":7,"n_rows":11,"n_cols":12,"rows_kept":11,"cut":false,"hidden":true,"merged":[[0,9,0,11]]}
["５年生",null,null,null,null,null,null,null,null,"活動の選択肢"]
[null,"単元","単元名","活　動","コミュニケーション","慣れ親しみ","理解・気づき",null,null,"活動１","活動２","活動３"]
[null,1,"Hello、 everyone.「アルファベット・自己紹介」では、","自己紹介を聞いて、具体的な情報を聞き取る活動を通して、\n好きなもの、欲しいものなどを含めて自己紹介をする活動を通して、\n活字体の文字で自分の名前を書いたり、そのつづりを言ったりする活動を通して、","進んで簡単な自己紹介をすることができた。","好きなものや、欲しいものなどを表したり尋ねたりする表現に慣れ親しんだ。また、活字体の大文字を読むことに慣れることができた。","日本語と英語の音声やリズムの違いに気付くことができた。",null,1,"自己紹介を聞いて、具体的な情報を聞き取る活動を通して、","好きなもの、欲しいものなどを含めて自己紹介をする活動を通して、","活字体の文字で自分の名前を書いたり、そのつづりを言ったりする活動を通して、"]
[null,2,"When is your birthday?「行事・誕生日」では、","誕生日カードを作成し贈るために、誕生日や好きなもの、欲しいものを聞き合う活動を通して、\n文字の音に慣れ親しみ、活字体の文字を読んだり書いたりする活動を通して、","進んで誕生日を尋ねたり答えたりすることができた。","月の言い方や、誕生日を尋ねたり答えたりする表現に慣れ親しんだ。また、活字体の大文字を書くことに慣れることができた。","世界には、様々な祭りや行事があることに気付くことができた。",null,2,"誕生日カードを作成し贈るために、誕生日や好きなもの、欲しいものを機器合う活動を通して、","文字の音に慣れ親しみ、活字体の文字を読んだり書いたりする活動を通して、"]
[null,3,"What do you have on Monday?「学校生活・教科・職業」では、","教科や曜日、自分で考えた時間割に尋ねたり答えたりする活動を通して、\n文字の音に慣れ親しみ、活字体の文字を読んだり書いたりする活動を通して、","進んで教科について尋ねたり答えたりすることができた。","教科について尋ねたり答えたりする表現に慣れ親しんだ。また、活字体の小文字を読むことに慣れることができた。","世界には様々な学校があり、日本と世界の学校生活の共通点と相違点に気付くことができた。",null,3,"教科や曜日、自分で考えた時間割に尋ねたり答えたりする活動を通して、","文字の音に慣れ親しみ、活字体の文字を読んだり書いたりする活動を通して、"]
[null,4,"What time do you get up?「一日の生活」では、","自分の一日の生活に関する基本的な表現を聞いて、具体的な情報を聞き取る活動を通して、\n自分の一日の生活について伝え合う活動を通して、\n活字体の文字の音に慣れ親しみ、活字体の文字を読んだり書いたりする活動を通して、","進んで自分の一日の生活について伝え合えようとすることができた。","一日の生活について尋ねたり答えたりする表現に慣れ親しんだ。また、活字体の小文字を書くことに慣れることができた。","世界には時差があることや様々な生活が営まれていることに気付くことができた。",null,4,"自分の一日の生活に関する基本的な表現を聞いて、具体的な情報を聞き取る活動を通して、","自分の一日の生活について伝え合う活動を通して、","活字体の文字の音に慣れ親しみ、活字体の文字を読んだり書いたりする活動を通して"]
[null,5,"She can run fast.He can jump high.「できること」では、","できること、できないことを尋ねたり答えたりする活動を通して、\n校内の先生についてできること、できないことを含めて紹介する活動を通して、\nスポーツをすることなどについて、簡単な語句を書き写す活動を通して、","進んで自分や第三者についてできることやできないことを紹介し合おうとすることができた。","自分や第三者について、できることやできないことを尋ねり言ったりする表現に慣れ親しんだ。また、文字の音に慣れることができた。","言語にはそれぞれ特色があり、アルファベットの文字の読み方には、名称のほかに音があることに気付くことができた。",null,5,"できること、できないことを尋ねたり答えたりする活動を通して","校内の先生についてできること、できないことを含めて紹介する活動を通して、","スポーツをすることなどについて、簡単な語句を書き写す活動を通して、"]
[null,6,"I want to go toItaly.「行ってみたい国や地域」では、","海外旅行を紹介して勧めたり、行きたい旅行を理由を含めて選んだりする活動を通して、\n文字の音に慣れ親しみ、活字体の文字を読んだり書いたりする活動を通して、\nポスターやパンフレットなどにある語句を読み、自分が必要とする情報を得る活動を通して、","進んで行きたい国や地域について説明したり、自分の考えを整理して伝えようとしたりすることができた。","国名や行きたい場所について、聞いたり言ったりすることに慣れ親しんだ。また、それらを書き写すことや文字の音に慣れることができた。","身の回りにアルファベット大文字が使われていることに気付くとともに、アルファベットと、その読み方を知ることができた。",null,6,"海外旅行を紹介して勧めたり、行きたい旅行を理由を含めて選んだりする活動を通して、","文字の音に慣れ親しみ、活字体の文字を読んだり書いたりする活動を通して、","ポスターやパンフレットなどにある語句を読み、自分が必要とする情報を得る活動を通して、"]
[null,7,"Where is the treasure?「位置と場所」では、","ある物の場所や物の位置関係について説明を聞き、道案内をしたり宝探しをしたりする活動を通して、\n文字の音に慣れ親しみ、活字体の文字を読んだり書いたりする活動を通して、\n地図やポスターなどにある語句を読み、自分が必要とする情報を得る活動を通して、","進んで場所を尋ねたり道案内をしたりすることができた。","道案内や、物の位置を尋ねたり答えたりする表現に慣れ親しんだ。また、簡単な語句を書き写すことや、文字の音に慣れることができた。","日本語と英語では道案内の仕方に違いがあることに気付くことができた。",null,7,"ある物の場所や物の位置関係について説明を聞き、道案内をしたり宝探しをしたりする活動を通して、","文字の音に慣れ親しみ、活字体の文字を読んだり書いたりする活動を通して、","地図やポスターなどにある語句を読み、自分が必要とする情報を得る活動を通して、"]
[null,8,"What would you like?「料理・値段」では、","丁寧な言い方で料理の注文をしたり、値段を尋ねたり答えたりする活動を通して、\n誰のためにどんなメニューを考えたのかについて話をしたり、相手の説明を聞いたりする活動を通して、\nメニューなどにある語句を読み、自分が必要とする情報を得る活動を通して、","進んで欲しいものを尋ねたり答えたりすることができた。","丁寧に欲しいものをを尋ねたり答えたりする表現に慣れ親しんだ。また、簡単な語句を書き写すことや、文字の音に慣れることができた。","英語にも欲しいものを尋ねたり言ったりする表現があることに気付くことができた。",null,8,"丁寧な言い方で料理の注文をしたり、値段を尋ねたり答えたりする活動を通して、","誰のためにどんなメニューを考えたのかについて短い話をしたり、相手の説明を聞いたりする活動を通して、","メニューなどにある語句を読み、自分が必要とする情報を得る活動を通して、"]
[null,9,"Who is your hero?「あこがれの人」では、","自分があこがれたり尊敬したり人について説明し、その人に対する自分の考えや気持ちなどを紹介する活動を通して、\n文字の音に慣れ親しみ、活字体の文字を読んだり書いたりする活動を通して、\nある人を紹介している簡単な語句や基本的な表現を書き写す活動を通して、","自分があこがれたり尊敬したりする人について、自分の意見を含めて紹介し合おうとした。","第三者が得意なことを表す表現に慣れ親しんだ。また、簡単な語句や表現を書き写すことや、文字の音に慣れることができた。","英語と日本語では、書き方に違いがあることに気付くことができた。",null,9,"自分があこがれたり尊敬したり人について説明し、その人に対する自分の考えや気持ちなどを紹介する活動を通して、","文字の音に慣れ親しみ、活字体の文字を読んだり書いたりする活動を通して、","ある人を紹介している簡単な語句や基本的な表現を書き写す活動を通して、"]

{"sheet":"６年","index":8,"n_rows":11,"n_cols":12,"rows_kept":11,"cut":false,"hidden":true,"merged":[[0,9,0,11]]}
["６年生",null,null,null,null,null,null,null,null,"活動の選択肢"]
[null,"単元","単元名","活　動","コミュニケーション","慣れ親しみ","理解・気づき",null,null,"活動１","活動２","活動３"]
[null,1,"This is me.「自己紹介」では、","これまでに学習した簡単な語句や基本的な表現などを使って、自己紹介をする活動を通して、\n自己紹介の基本的な表現を書き写したり、意味を理解したりする活動を通して、","好きなことなどを含めて自分のことを伝え合おうとすることができた。","自己紹介に関する表現や好きなこと、できることなどを表す表現に慣れ親しんだ。また、活字体の文字で自分の名前を書いたり、その綴りを言ったり聞いたりすることに慣れることができた。","英語での名前の表記の仕方に気付くことができた。",null,1,"これまでに学習した簡単な語句や基本的な表現などを使って、自己紹介をする活動を通して、","自己紹介の基本的な表現を書き写したり、意味を理解したりする活動を通して、"]
[null,2,"Welcome to Japan.「日本の文化」では、","日本の文化について伝え合う活動を通して、\n日本の文化に関する簡単な語句や基本的な表現を書き写す活動を通して、","進んで日本や静岡の行事や食べ物や、自分が好きな日本文化について伝え合おうとすることができた。","日本や静岡の文化の特徴を伝えるための表現に慣れ親しんだ。また、例を参考に語順を意識しながら書くことに慣れることができた。","自分の国や静岡の文化の良さや特徴について気付くことができた。",null,2,"日本の文化について伝え合う活動を通して、","日本の文化に関する簡単な語句や基本的な表現を書き写す活動を通して、"]
[null,3,"He is famous.She is great.「人物紹介」では、","日本や世界で活躍する人物などに関する短い紹介を聞いたり、その人物などになったつもりで自己紹介したりする活動を通して、\nある人物になりきって自己紹介したことを、語順を意識して書く活動を通して、","進んで自分や第三者についてできることやできないことなどを伝え合おうとすることができた。","自分や第三者ができることやできないこと、何が好き、を表す表現に慣れ親しんだ。また、例を参考に紹介する文を書くことに慣れることができた。","<主語+動詞+目的語>の文の語順に気付くことができた。",null,3,"日本や世界で活躍する人物などに関する短い紹介を聞いたり、その人物などになったつもりで自己紹介したりする活動を通して、","ある人物になりきって自己紹介したことを、語順を意識して書く活動を通して、"]
[null,4,"I like my town.「自分たちの町・地域」では、","自分たちの町について自分の考えを発表する活動を通して、\n自分たちの町に関する基本的な表現を書き写す活動を通して、","進んで地域のよさや課題などについて自分の考えや気持ちを伝え合おうとすることができた。","地域にどのような施設があるのか、また欲しいのか、さらに地域のよさを表す表現に慣れ親しんだ。また、書くことに慣れることができた。","日本語と英語の語順の違いに気付くことができた。",null,4,"自分たちの町について自分の考えを発表する活動を通して、","自分たちの町に関する基本的な表現を書き写す活動を通して、"]
[null,5,"My Summer Vacation「夏休みの思い出」では、","夏休みの思い出について伝え合う活動を通して、\n夏休みの思い出について、簡単な語句を読む活動を通して、\n語順を意識しながら簡単な語句を書く活動を通して、","進んで夏休みの思い出について伝え合おうとすることができた。","夏休みに行った場所や食べた物、楽しんだこと、感想などを表す表現に慣れ親しんだ。また、夏休みの思い出について簡単な語句や基本的な表現を推測しながら読んだり、例を参考に書いたりすることに慣れることができた。","英語の書き方の規則に気付くことができた。",null,5,"夏休みの思い出について伝え合う活動を通して、","夏休みの思い出について、簡単な語句を読む活動を通して、","語順を意識しながら簡単な語句を書く活動を通して、"]
[null,6,"What sport do you want to watch?「オリンピック・パラリンピック」では、","オリンピックやパラリンピックで観たい競技について尋ねたり答えたりし合う活動を通して、\n観たい競技について、簡単な語句を読む活動を通して、\n語順を意識しながら簡単な語句を書く活動を通して、","進んでオリンピックやパラリンピックで見たい競技とその理由などについて伝え合おうとすることができた。","オリンピックやパラリンピックで見たい競技とその理由などを表す表現に慣れ親しんだ。また、例を参考に書くことに慣れることができた。","オリンピックやパラリンピックには様々な興味深い競技があることに気付くことができた。",null,6,"オリンピックやパラリンピックで観たい競技について尋ねたり答えたりし合う活動を通して、","観たい競技について、簡単な語句を読む活動を通して、","語順を意識しながら簡単な語句を書く活動を通して、"]
[null,7,"My Best Memory「小学校生活・思い出」では、","小学校生活を振り返り、思い出に残る行事について伝え合う活動を通して、\n小学校生活の思い出について、簡単な語句や基本的な表現を読む活動を通して、\n語順を意識しながら簡単な語句を書いたりする活動を通して、","思い出の学校行事について伝え合おうとすることができた。","学校行事について表す表現に慣れ親しんだ。また、学校行事について簡単な語句や基本的な表現を推測しながら読んだり、例を参考に書いたりすることに慣れることができた。","世界には様々な学校生活があることに気付くことができた。",null,7,"小学校生活を振り返り、思い出に残る行事について伝え合う活動を通して、","小学校生活の思い出について、簡単な語句や基本的な表現を読む活動を通して、","語順を意識しながら簡単な語句を書く活動を通して、"]
[null,8,"What do you want to be?「将来の夢・職業」では、","自分の将来の夢について発表する活動を通して、\n将来の夢について、簡単な語句や表現を読む活動を通して、\n語順を意識しながら簡単な語句を書く活動を通して、","進んで将来の夢について伝え合おうとしていることができた。","将来就きたい職業やしたいこと、その理由などを表す表現に慣れ親しんだ。また、将来の夢について、簡単な語句や基本的な表現で書かれた英語を推測しながら読んだり、例を参考にしながら語と語のつながりに注意しながら書いたりすることに慣れることができた。","職業に関する英語表現を知るとともに、友達同士お互いに違う夢を持っていることに気付くことができた。",null,8,"自分の将来の夢について発表する活動を通して、","将来の夢について、簡単な語句や表現を読む活動を通して、","語順を意識しながら簡単な語句を書く活動を通して、"]
[null,9,"Junior High School Life「中学校生活・部活動」では、","中学校でやってみたいことについて伝え合う活動を通して、\n中学校や将来の夢について、スピーチの原稿を考える活動を通して、","進んで中学校生活について伝え合おうとすることができた。","中学校の部活動や学校行事などについて自分の考えを表す表現に慣れ親しんだ。中学校生活について書かれている英語を推測しながら読むことに慣れることができた。","身の回りには英語が使われている場面があることに気付くことができた。",null,9,"中学校でやってみたいことについて伝え合う活動を通して、","中学校や将来の夢について、スピーチの原稿を考える活動を通して、"]